Bug report #16343

Updated by Jürgen Fischer almost 7 years ago

Even after commit:85a0db24f32351f6096cd8282f03ad5c2f4e6ef5, 85a0db24f32351f6096cd8282f03ad5c2f4e6ef5, build still fails with sip 4.19.1 and pyqt4 4.12


[ 91%] Generating ui_dialogAbout.py

Traceback (most recent call last):

File "../../../../../scripts/pyuic-wrapper.py", line 26, in <module>

import qgis.PyQt.uic.pyuic

File "/home/dnewgard/PKGBUILDs/qgis/src/QGIS/build/output/python/qgis/__init__.py", line 27, in <m


from qgis.core import QgsFeature, QgsGeometry

File "/home/dnewgard/PKGBUILDs/qgis/src/QGIS/build/output/python/qgis/core/__init__.py", line 30,

in <module>

from qgis._core import *

RuntimeError: qgis._core cannot import type 'QList<QVariant>' from PyQt4.QtCore

make[2]: *** [python/plugins/GdalTools/tools/CMakeFiles/zzz-GdalTools-2-depend.dir/build.make:118: p

ython/plugins/GdalTools/tools/ui_dialogAbout.py] Error 1

make[1]: *** [CMakeFiles/Makefile2:4667: python/plugins/GdalTools/tools/CMakeFiles/zzz-GdalTools-2-d

epend.dir/all] Error 2

make[1]: *** Waiting for unfinished jobs....++

Build of 2.14 succeeds, but has the same error at runtime, causing python support to be disabled.